|
我在redhat 9.0上编译arm版本的apache时提示:输入make后提示的 不知道哪里出了错,谢谢啦~~ cd ../apache_1.3.39 make 出现以下错误信息: gcc -c -I../os/unix -I../include -DSOLARIS2=290 -DMOD_SSL=208114 -DEAPI `../apaci` util.c util.c: In function `ap_find_token': util.c:1410: error: `test_char_table' undeclared (first use in this function) util.c:1410: error: (Each undeclared identifier is reported only once util.c:1410: error: for each function it appears in.) util.c:1410: error: `T_HTTP_TOKEN_STOP' undeclared (first use in this function) util.c: In function `ap_escape_logitem': util.c:1487: error: `test_char_table' undeclared (first use in this function) util.c:1487: error: `T_ESCAPE_LOGITEM' undeclared (first use in this function) util.c: In function `ap_escape_shell_cmd': util.c:1547: error: `test_char_table' undeclared (first use in this function) util.c:1547: error: `T_ESCAPE_SHELL_CMD' undeclared (first use in this function) util.c: In function `ap_escape_path_segment': util.c:1651: error: `test_char_table' undeclared (first use in this function) util.c:1651: error: `T_ESCAPE_PATH_SEGMENT' undeclared (first use in this function) util.c: In function `ap_os_escape_path': util.c:1680: error: `test_char_table' undeclared (first use in this function) util.c:1680: error: `T_OS_ESCAPE_PATH' undeclared (first use in this function) make[3]: *** [util.o] Error 1 make[2]: *** [subdirs] Error 1 make[2]: Leaving directory `/httpd/tmp/apache_1.3.27/src' make[1]: *** [build-std] Error 2 make[1]: Leaving directory `/httpd/tmp/apache_1.3.27' make: *** [build] Error 2 |
共2条
1/1 1 跳转至页
Apache 的util.c编译错误
关键词: Apache util.c 编译 错误 funct
共2条
1/1 1 跳转至页
回复
我要赚赏金打赏帖 |
|
|---|---|
| 28BYJ-48机械臂实现人脸跟随被打赏¥24元 | |
| 基于RK3506B的片温识读功能的实现被打赏¥25元 | |
| 【瑞萨RA8D1测评】基于FreeRTOS的lvgl移植教程被打赏¥29元 | |
| 电子价签墨水屏开发被打赏¥35元 | |
| 【Ozone】RTT 打印终端使用被打赏¥29元 | |
| BMS保护板绝缘检测功能-不平衡电桥技术绝缘电阻检测设计与实现被打赏¥34元 | |
| 给28BYJ-48三自由度机械臂加一个网页控制台被打赏¥32元 | |
| 用28BYJ-48电机从零搭一台三自由度机械臂被打赏¥33元 | |
| 【英飞凌开发经验】ModusToolbox配置EdgeTalk外设被打赏¥27元 | |
| 基于BQ76952PFBR的BMS保护板热插拔损坏的原因和处理措施被打赏¥32元 | |
我要赚赏金
